Target
Proto-oncogene tyrosine-protein kinase Src
Ligand
BDBM247099
Substrate
Meas. Tech.
c-Src Enzyme Inhibition 1
IC50
2.00±n/a nM
Citation
 Cariou, CACharron, CEFordyce, EAHamza, DFyfe, MCIto, KKing-Underwood, JMurray, PJOnions, STThom, SMWatson, HTWilliams, JG Pyrazolyl-ureas as kinase inhibitors US Patent  US9701670 Publication Date 7/11/2017 
Target
Name:
Proto-oncogene tyrosine-protein kinase Src
Synonyms:
Calmodulin/Proto-oncogene tyrosine-protein kinase Src Proto-oncogene c-Src SRC SRC_HUMAN V-src sarcoma (Schmidt-Ruppin A-2) viral oncogene homolog (avian) p60-Src | pp60c-src
Type:
Protein
Mol. Mass.:
59838.60
Organism:
Homo sapiens (Human)
Description:
P12931
Residue:
536
  
Inhibitor
Name:
BDBM247099
Synonyms:
3-((4-((4-(3-(3-(tert-butyl)-1-(p-tolyl)-1H-pyrazol-5-yl)ureido)naphthalen-1-yl)oxy)pyrimidin-2-yl)amino)-N-(2-(dimethylamino)ethyl)-5-methoxybenzamide | US9701670, 43
Type:
Small organic molecule
Emp. Form.:
C41H45N9O4
Mol. Mass.:
727.8539
SMILES:
COc1cc(Nc2nccc(Oc3ccc(NC(=O)Nc4cc(nn4-c4ccc(C)cc4)C(C)(C)C)c4ccccc34)n2)cc(c1)C(=O)NCCN(C)C
: