Target
Mitogen-activated protein kinase 14
Ligand
BDBM247104
Substrate
Meas. Tech.
p38 MAPKalpaha Enzyme Inhibition 1
IC50
2.00±n/a nM
Citation
 Cariou, CACharron, CEFordyce, EAHamza, DFyfe, MCIto, KKing-Underwood, JMurray, PJOnions, STThom, SMWatson, HTWilliams, JG Pyrazolyl-ureas as kinase inhibitors US Patent  US9701670 Publication Date 7/11/2017 
Target
Name:
Mitogen-activated protein kinase 14
Synonyms:
CSAID-binding protein CSBP1 CSPB1 MAP kinase 14 MAP kinase p38 alpha MAPK14 MK14_HUMAN Mitogen-activated protein kinase p38 alpha Stress-activated protein kinase 2a | p38 MAP kinase alpha/beta
Type:
Serine/threonine-protein kinase
Mol. Mass.:
41286.76
Organism:
Homo sapiens (Human)
Description:
Q16539
Residue:
360
  
Inhibitor
Name:
BDBM247104
Synonyms:
3-((4-((4-(3-(3-ethyl-1-(p-tolyl)-1H-pyrazol-5-yl)ureido)naphthalen-1-yl)oxy)pyrimidin-2-yl)amino)-5-methoxy-N-(2-morpholinoethyl)benzamide | US9701670, 49
Type:
Small organic molecule
Emp. Form.:
C41H43N9O5
Mol. Mass.:
741.8374
SMILES:
CCc1cc(NC(=O)Nc2ccc(Oc3ccnc(Nc4cc(OC)cc(c4)C(=O)NCCN4CCOCC4)n3)c3ccccc23)n(n1)-c1ccc(C)cc1
: