Target
Mitogen-activated protein kinase 14
Ligand
BDBM247127
Substrate
Meas. Tech.
p38 MAPKalpaha Enzyme Inhibition 1
IC50
<1.000±n/a nM
Citation
 Cariou, CACharron, CEFordyce, EAHamza, DFyfe, MCIto, KKing-Underwood, JMurray, PJOnions, STThom, SMWatson, HTWilliams, JG Pyrazolyl-ureas as kinase inhibitors US Patent  US9701670 Publication Date 7/11/2017 
Target
Name:
Mitogen-activated protein kinase 14
Synonyms:
CSAID-binding protein CSBP1 CSPB1 MAP kinase 14 MAP kinase p38 alpha MAPK14 MK14_HUMAN Mitogen-activated protein kinase p38 alpha Stress-activated protein kinase 2a | p38 MAP kinase alpha/beta
Type:
Serine/threonine-protein kinase
Mol. Mass.:
41286.76
Organism:
Homo sapiens (Human)
Description:
Q16539
Residue:
360
  
Inhibitor
Name:
BDBM247127
Synonyms:
3-((6-((4-(3-(3-(tert-butyl)-1-(p-tolyl)-1H-pyrazol-5-yl)ureido)naphthalen-1-yl)oxy)pyrimidin-4-yl)amino)-5-methoxy-N-(2-morpholinoethyl)benzamide | US9701670, 72
Type:
Small organic molecule
Emp. Form.:
C43H47N9O5
Mol. Mass.:
769.8906
SMILES:
COc1cc(Nc2cc(Oc3ccc(NC(=O)Nc4cc(nn4-c4ccc(C)cc4)C(C)(C)C)c4ccccc34)ncn2)cc(c1)C(=O)NCCN1CCOCC1
: