Target
Tyrosine-protein kinase BTK
Ligand
BDBM324276
Substrate
Meas. Tech.
In Vitro BTK Kinase Assay
IC50
505±n/a nM
Citation
 Hopkins, BTMa, BPrince, RMarx, ILyssikatos, JP Inhibiting agents for bruton's tyrosine kinase US Patent  US10227341 Publication Date 3/12/2019 
Target
Name:
Tyrosine-protein kinase BTK
Synonyms:
AGMX1 Agammaglobulinaemia tyrosine kinase B cell progenitor kinase BPK BTK_HUMAN Tyrosine Kinase BTK Tyrosine-protein kinase BTK (BTK)
Type:
Enzyme
Mol. Mass.:
76289.95
Organism:
Homo sapiens (Human)
Description:
Q06187
Residue:
659
  
Inhibitor
Name:
BDBM324276
Synonyms:
5-(tert-butyl)-N—((R)-8-(2-((1-methyl-1H-pyrazol-4-yl)amino)pyrimidin-4-yl)-2-((R)-tetrahydrofuran-3-yl)-2,3,4,5-tetrahydro-1H-benzo[c]azepin-5-yl)-1,3,4-oxadiazole-2-carboxamide US10227341, Compound 20 US11858926, Compound 20
Type:
Small organic molecule
Emp. Form.:
C29H35N9O3
Mol. Mass.:
557.6467
SMILES:
Cn1cc(Nc2nccc(n2)-c2ccc3[C@@H](CCN(Cc3c2)[C@@H]2CCOC2)NC(=O)c2nnc(o2)C(C)(C)C)cn1
: