Target
Tyrosine-protein kinase BTK
Ligand
BDBM324318
Substrate
Meas. Tech.
In Vitro BTK Kinase Assay
IC50
505±n/a nM
Citation
 Hopkins, BTMa, BPrince, RMarx, ILyssikatos, JP Inhibiting agents for bruton's tyrosine kinase US Patent  US10227341 Publication Date 3/12/2019 
Target
Name:
Tyrosine-protein kinase BTK
Synonyms:
AGMX1 Agammaglobulinaemia tyrosine kinase B cell progenitor kinase BPK BTK_HUMAN Tyrosine Kinase BTK Tyrosine-protein kinase BTK (BTK)
Type:
Enzyme
Mol. Mass.:
76289.95
Organism:
Homo sapiens (Human)
Description:
Q06187
Residue:
659
  
Inhibitor
Name:
BDBM324318
Synonyms:
5-(tert-butyl)-N-(2-ethyl- 8-(2-((1-methyl-1H- pyrazol-4- yl)amino)pyrimidin-4- yl)-2,3,4,5-tetrahydro- 1H-benzo[c]azepin- 5-yl)- 1,3,4-oxadiazole-2- carboxamide US10227341, Compound 83 US11858926, Compound 83
Type:
Small organic molecule
Emp. Form.:
C27H33N9O2
Mol. Mass.:
515.61
SMILES:
CCN1CCC(NC(=O)c2nnc(o2)C(C)(C)C)c2ccc(cc2C1)-c1ccnc(Nc2cnn(C)c2)n1
: