Target
Tyrosine-protein kinase BTK
Ligand
BDBM324352
Substrate
Meas. Tech.
In Vitro BTK Kinase Assay
IC50
505±n/a nM
Citation
 Hopkins, BTMa, BPrince, RMarx, ILyssikatos, JP Inhibiting agents for bruton's tyrosine kinase US Patent  US10227341 Publication Date 3/12/2019 
Target
Name:
Tyrosine-protein kinase BTK
Synonyms:
AGMX1 Agammaglobulinaemia tyrosine kinase B cell progenitor kinase BPK BTK_HUMAN Tyrosine Kinase BTK Tyrosine-protein kinase BTK (BTK)
Type:
Enzyme
Mol. Mass.:
76289.95
Organism:
Homo sapiens (Human)
Description:
Q06187
Residue:
659
  
Inhibitor
Name:
BDBM324352
Synonyms:
(R)-5-(tert-butyl)-N-(2- (2-((1-methyl-5- (trifluoromethyl)-1H- pyrazol-4- yl)amino)pyrimidin-4- yl)-6,7,8,9-tetrahydro- 5H-benzo[7]annulen-5- yl)-1,2,4-oxadiazole-3- carboxamide US10227341, Compound 153 US11858926, Compound 153
Type:
Small organic molecule
Emp. Form.:
C27H29F3N8O2
Mol. Mass.:
554.5668
SMILES:
Cn1ncc(Nc2nccc(n2)-c2ccc3[C@@H](CCCCc3c2)NC(=O)c2noc(n2)C(C)(C)C)c1C(F)(F)F
: