Target
Tyrosine-protein kinase BTK
Ligand
BDBM324359
Substrate
Meas. Tech.
In Vitro BTK Kinase Assay
IC50
5.50±n/a nM
Citation
 Hopkins, BTMa, BPrince, RMarx, ILyssikatos, JP Inhibiting agents for bruton's tyrosine kinase US Patent  US10227341 Publication Date 3/12/2019 
Target
Name:
Tyrosine-protein kinase BTK
Synonyms:
AGMX1 Agammaglobulinaemia tyrosine kinase B cell progenitor kinase BPK BTK_HUMAN Tyrosine Kinase BTK Tyrosine-protein kinase BTK (BTK)
Type:
Enzyme
Mol. Mass.:
76289.95
Organism:
Homo sapiens (Human)
Description:
Q06187
Residue:
659
  
Inhibitor
Name:
BDBM324359
Synonyms:
1-(tert-butyl)-N-(7-(2- ((1-methyl-1H-pyrazol- 4-yl)amino)pyrimidin- 4-yl)-2,3,4,5- tetrahydro-1H- benzo[d]azepin-1-yl)- 1H-1,2,3-triazole-4- carboxamide US10227341, Compound 51 US11858926, Compound 51
Type:
Small organic molecule
Emp. Form.:
C25H30N10O
Mol. Mass.:
486.5721
SMILES:
Cn1cc(Nc2nccc(n2)-c2ccc3C(CNCCc3c2)NC(=O)c2cn(nn2)C(C)(C)C)cn1
: