Target
Tyrosine-protein kinase BTK
Ligand
BDBM324376
Substrate
Meas. Tech.
In Vitro BTK Kinase Assay
IC50
5.50±n/a nM
Citation
 Hopkins, BTMa, BPrince, RMarx, ILyssikatos, JP Inhibiting agents for bruton's tyrosine kinase US Patent  US10227341 Publication Date 3/12/2019 
Target
Name:
Tyrosine-protein kinase BTK
Synonyms:
AGMX1 Agammaglobulinaemia tyrosine kinase B cell progenitor kinase BPK BTK_HUMAN Tyrosine Kinase BTK Tyrosine-protein kinase BTK (BTK)
Type:
Enzyme
Mol. Mass.:
76289.95
Organism:
Homo sapiens (Human)
Description:
Q06187
Residue:
659
  
Inhibitor
Name:
BDBM324376
Synonyms:
(R)-5-(tert-butyl)-N-(8- (2-((1,5-dimethyl-1H- pyrazol-4- yl)amino)pyrimidin-4- yl)-2-(2-hydroxyethyl)- 2,3,4,5-tetrahydro-1H- benzo[c]azepin-5-yl)- 1,3,4-oxadiazole-2- carboxamide US10227341, Compound 100 US11858926, Compound 100
Type:
Small organic molecule
Emp. Form.:
C28H35N9O3
Mol. Mass.:
545.636
SMILES:
Cc1c(Nc2nccc(n2)-c2ccc3[C@@H](CCN(CCO)Cc3c2)NC(=O)c2nnc(o2)C(C)(C)C)cnn1C
: