Target
Tyrosine-protein kinase BTK
Ligand
BDBM324378
Substrate
Meas. Tech.
In Vitro BTK Kinase Assay
IC50
5.50±n/a nM
Citation
 Hopkins, BTMa, BPrince, RMarx, ILyssikatos, JP Inhibiting agents for bruton's tyrosine kinase US Patent  US10227341 Publication Date 3/12/2019 
Target
Name:
Tyrosine-protein kinase BTK
Synonyms:
AGMX1 Agammaglobulinaemia tyrosine kinase B cell progenitor kinase BPK BTK_HUMAN Tyrosine Kinase BTK Tyrosine-protein kinase BTK (BTK)
Type:
Enzyme
Mol. Mass.:
76289.95
Organism:
Homo sapiens (Human)
Description:
Q06187
Residue:
659
  
Inhibitor
Name:
BDBM324378
Synonyms:
(R)-5-(tert-butyl)-N-(8- (2-((1,3-dimethyl-1H- pyrazol-4- yl)amino)pyrimidin-4- yl)-2-(2,2,2- trifluoroethyl)-2,3,4,5- tetrahydro-1H- benzo[c]azepin-5-yl)- 1,3,4-oxadiazole-2- carboxamide US10227341, Compound 110 US11858926, Compound 110
Type:
Small organic molecule
Emp. Form.:
C28H32F3N9O2
Mol. Mass.:
583.608
SMILES:
Cc1nn(C)cc1Nc1nccc(n1)-c1ccc2[C@@H](CCN(CC(F)(F)F)Cc2c1)NC(=O)c1nnc(o1)C(C)(C)C
: