Target
Tyrosine-protein kinase BTK
Ligand
BDBM324386
Substrate
Meas. Tech.
In Vitro BTK Kinase Assay
IC50
5.50±n/a nM
Citation
 Hopkins, BTMa, BPrince, RMarx, ILyssikatos, JP Inhibiting agents for bruton's tyrosine kinase US Patent  US10227341 Publication Date 3/12/2019 
Target
Name:
Tyrosine-protein kinase BTK
Synonyms:
AGMX1 Agammaglobulinaemia tyrosine kinase B cell progenitor kinase BPK BTK_HUMAN Tyrosine Kinase BTK Tyrosine-protein kinase BTK (BTK)
Type:
Enzyme
Mol. Mass.:
76289.95
Organism:
Homo sapiens (Human)
Description:
Q06187
Residue:
659
  
Inhibitor
Name:
BDBM324386
Synonyms:
5-(tert-butyl)-N- (8-(2-((1- methyl-1H-pyrazol-4- yl)amino)pyrimidin-4- yl)-2-(tetrahydrofuran-3- yl)-2,3,4,5-tetrahydro- 1H-benzo[c]azepin- 5-yl)- 1,3,4-thiadiazole-2- carboxamide US10227341, Compound 131 US11858926, Compound 131
Type:
Small organic molecule
Emp. Form.:
C29H35N9O2S
Mol. Mass.:
573.712
SMILES:
Cn1cc(Nc2nccc(n2)-c2ccc3C(CCN(Cc3c2)C2CCOC2)NC(=O)c2nnc(s2)C(C)(C)C)cn1
: