Target
Metabotropic glutamate receptor 4
Ligand
BDBM368528
Substrate
Meas. Tech.
Metabotropic Glutamate Receptor Activity
EC50
3320±n/a nM
Citation
 Conn, PJLindsley, CWNiswender, CMHopkins, CRBronson, JWu, YEmmitte, KPanarese, JEngers, DWEngers, J Isoquiniline and napthalene-substituted compounds as mGluR4 allosteric potentiators, compositions, and methods of treating neurological dysfunction US Patent  US10227343 Publication Date 3/12/2019 
Target
Name:
Metabotropic glutamate receptor 4
Synonyms:
GPRC1D GRM4_HUMAN MGLUR4 Metabotropic glutamate receptor 4 (mGlu4) metabotropic glutamate 4
Type:
Protein
Mol. Mass.:
101899.95
Organism:
Homo sapiens (Human)
Description:
Q14833
Residue:
912
  
Inhibitor
Name:
BDBM368528
Synonyms:
3-chloro-N1,N1-diethyl- N6-(1H-pyrazolo [4,3-b]pyridin- 3-yl)isoquinoline-1,6- diamine | US10227343, Example 60
Type:
Small organic molecule
Emp. Form.:
C19H19ClN6
Mol. Mass.:
366.847
SMILES:
CCN(CC)c1nc(Cl)cc2cc(Nc3n[nH]c4cccnc34)ccc12
: