Target
Metabotropic glutamate receptor 4
Ligand
BDBM368540
Substrate
Meas. Tech.
Metabotropic Glutamate Receptor Activity
EC50
>10000±n/a nM
Citation
 Conn, PJLindsley, CWNiswender, CMHopkins, CRBronson, JWu, YEmmitte, KPanarese, JEngers, DWEngers, J Isoquiniline and napthalene-substituted compounds as mGluR4 allosteric potentiators, compositions, and methods of treating neurological dysfunction US Patent  US10227343 Publication Date 3/12/2019 
Target
Name:
Metabotropic glutamate receptor 4
Synonyms:
GPRC1D GRM4_HUMAN MGLUR4 Metabotropic glutamate receptor 4 (mGlu4) metabotropic glutamate 4
Type:
Protein
Mol. Mass.:
101899.95
Organism:
Homo sapiens (Human)
Description:
Q14833
Residue:
912
  
Inhibitor
Name:
BDBM368540
Synonyms:
1,3,4-trimethyl-N-(1H- pyrazolo[4,3-b]pyridin-3- yl)isoquinolin-6-amine | US10227343, Example 72
Type:
Small organic molecule
Emp. Form.:
C18H17N5
Mol. Mass.:
303.3611
SMILES:
Cc1nc(C)c2ccc(Nc3n[nH]c4cccnc34)cc2c1C
: