Target
Metabotropic glutamate receptor 4
Ligand
BDBM368578
Substrate
Meas. Tech.
Metabotropic Glutamate Receptor Activity
EC50
31.4±n/a nM
Citation
 Conn, PJLindsley, CWNiswender, CMHopkins, CRBronson, JWu, YEmmitte, KPanarese, JEngers, DWEngers, J Isoquiniline and napthalene-substituted compounds as mGluR4 allosteric potentiators, compositions, and methods of treating neurological dysfunction US Patent  US10227343 Publication Date 3/12/2019 
Target
Name:
Metabotropic glutamate receptor 4
Synonyms:
GPRC1D GRM4_HUMAN MGLUR4 Metabotropic glutamate receptor 4 (mGlu4) metabotropic glutamate 4
Type:
Protein
Mol. Mass.:
101899.95
Organism:
Homo sapiens (Human)
Description:
Q14833
Residue:
912
  
Inhibitor
Name:
BDBM368578
Synonyms:
1-(1,1-difluoro-2-methyl- propyl)-N-(1H-pyrazolo [4,3-b]pyridin-3-yl) isoquinolin-6-amine | US10227343, Example 180
Type:
Small organic molecule
Emp. Form.:
C19H17F2N5
Mol. Mass.:
353.3686
SMILES:
CC(C)C(F)(F)c1nccc2cc(Nc3n[nH]c4cccnc34)ccc12
: