Target
Nuclear receptor ROR-gamma
Ligand
BDBM189920
Substrate
Meas. Tech.
Assay of Co-Activator Recruitment by TR-FRET
IC50
13.5±n/a nM
Citation
 Schnute, MEFlick, ACJones, PKaila, NMente, SRTrzupek, JDVazquez, MLWennerstal, GMXing, LZamaratski, EZhang, LUnwalla, RJ Methyl- and trifluoromethyl-substituted pyrrolopyridine modulators of RORC2 and methods of use therof US Patent  US10227346 Publication Date 3/12/2019 
Target
Name:
Nuclear receptor ROR-gamma
Synonyms:
NR1F3 Nuclear receptor ROR-gamma (RORC) RAR-related orphan receptor C (RORc) RORG RZRG Retinoid-related orphan receptor-gamma (RORc)
Type:
Enzyme Catalytic Domain
Mol. Mass.:
58218.40
Organism:
Homo sapiens (Human)
Description:
P51449
Residue:
518
  
Inhibitor
Name:
BDBM189920
Synonyms:
US10227346, Example 43 US9670201, 43 (R)-3-cyano-N-(1,4-dimethyl-3-(1-(2,3,3-trimethylbutanoyl)piperidin-4-yl)-1H-pyrrolo[2,3-b]pyridin-5-yl)-4-(2-methoxyethoxy)benzamide | US9920054, Example 43
Type:
Small organic molecule
Emp. Form.:
C32H41N5O4
Mol. Mass.:
559.699
SMILES:
COCCOc1ccc(cc1C#N)C(=O)Nc1cnc2n(C)cc(C3CCN(CC3)C(=O)[C@H](C)C(C)(C)C)c2c1C
: