Target
Phosphatidylinositol 3-kinase regulatory subunit beta
Ligand
BDBM368594
Substrate
Meas. Tech.
TR-FRET Assay
IC50
150±n/a nM
Citation
 Chandrasekhar, JPatel, LPerreault, SPhillips, GTill, NATreiberg, JA Phosphatidylinositol 3-kinase inhibitors US Patent  US10227350 Publication Date 3/12/2019 
Target
Name:
Phosphatidylinositol 3-kinase regulatory subunit beta
Synonyms:
P85B_HUMAN PI3-kinase subunit p85-beta PIK3R2 PtdIns-3-kinase regulatory subunit beta | PtdIns-3-kinase regulatory subunit p85-beta
Type:
Enzyme Subunit
Mol. Mass.:
81542.75
Organism:
Homo sapiens (Human)
Description:
O00459
Residue:
728
  
Inhibitor
Name:
BDBM368594
Synonyms:
US10227350, Compound 15
Type:
Small organic molecule
Emp. Form.:
C24H18ClN5O
Mol. Mass.:
427.886
SMILES:
Cc1nc2c(cc(cc2n1-c1ccnc2c(Cl)cccc12)-c1ccnc(C)c1)C(N)=O
: