Target
Phosphatidylinositol 3-kinase regulatory subunit beta
Ligand
BDBM368627
Substrate
Meas. Tech.
TR-FRET Assay
IC50
1100±n/a nM
Citation
 Chandrasekhar, JPatel, LPerreault, SPhillips, GTill, NATreiberg, JA Phosphatidylinositol 3-kinase inhibitors US Patent  US10227350 Publication Date 3/12/2019 
Target
Name:
Phosphatidylinositol 3-kinase regulatory subunit beta
Synonyms:
P85B_HUMAN PI3-kinase subunit p85-beta PIK3R2 PtdIns-3-kinase regulatory subunit beta | PtdIns-3-kinase regulatory subunit p85-beta
Type:
Enzyme Subunit
Mol. Mass.:
81542.75
Organism:
Homo sapiens (Human)
Description:
O00459
Residue:
728
  
Inhibitor
Name:
BDBM368627
Synonyms:
US10227350, Compound 46
Type:
Small organic molecule
Emp. Form.:
C25H16F3N7
Mol. Mass.:
471.4366
SMILES:
Cc1nc2c(cc(cc2n1-c1ccnc2c(F)ccc(F)c12)-c1ccnc(F)c1C)-c1nnc[nH]1
: