Target
Serine/threonine-protein kinase/endoribonuclease IRE1
Ligand
BDBM160452
Substrate
Meas. Tech.
IRE-1alpha Assay
pH
7.5±n/a
Temperature
303.15±n/a K
IC50
<100±n/a nM
EC50
<10000±n/a nM
Comments
extracted
Citation
 Zeng, QToro, APatterson, JBWade, WSZubovics, ZYang, YWu, Z IRE-1α inhibitors US Patent  US9693992 Publication Date 7/4/2017 
Target
Name:
Serine/threonine-protein kinase/endoribonuclease IRE1
Synonyms:
ERN1 Endoplasmic reticulum-to-nucleus signaling 1 IRE1 Inositol requiring enzyme 1 (IRE-1alpha) Inositol-requiring protein 1 Ire1-alpha Serine/threonine-protein kinase/endoribonuclease IRE1 hIRE1p
Type:
Enzyme
Mol. Mass.:
109731.20
Organism:
Homo sapiens (Human)
Description:
O75460
Residue:
977
  
Inhibitor
Name:
BDBM160452
Synonyms:
US9040714, 174 | US9693992, 174
Type:
Small organic molecule
Emp. Form.:
C17H19NO6
Mol. Mass.:
333.3359
SMILES:
CCNC(=O)CCc1c(C)c2cc(OC)c(O)c(C=O)c2oc1=O
: