Target
Alpha-1,6-mannosyl-glycoprotein 2-beta-N-acetylglucosaminyltransferase
Ligand
BDBM247158
Substrate
Meas. Tech.
MGAT LCMS Assay
pH
7.4±n/a
IC50
363±n/a nM
Comments
extracted
Citation
 Meng, WZhao, G Dihydropyridinone MGAT2 inhibitors for use in the treatment of metabolic disorders US Patent  US9701672 Publication Date 7/11/2017 
Target
Name:
Alpha-1,6-mannosyl-glycoprotein 2-beta-N-acetylglucosaminyltransferase
Synonyms:
2.4.1.143 GNT-II MGAT2 Mannoside acetylglucosaminyltransferase 2 Monoacylglycerol acyltransferase type 2 (h-MGAT2) h-MGAT2 (human monoacylglycerol acyltransferase type 2)
Type:
Mol. Mass.:
51567.80
Organism:
Homo sapiens (Human)
Description:
Q10469
Residue:
447
  
Inhibitor
Name:
BDBM247158
Synonyms:
1-(1-(Cyclopropylmethyl)-1H-pyrazol-3-yl)ethanone | US9701672, 12
Type:
Small organic molecule
Emp. Form.:
C24H24F6N6O2S
Mol. Mass.:
574.542
SMILES:
CN(C)Cc1ccc(s1)C1=C(c2nnn[nH]2)C(=O)N[C@@](C1)(c1ccc(OCCCC(F)(F)F)cc1)C(F)(F)F
: