Target
Alpha-1,6-mannosyl-glycoprotein 2-beta-N-acetylglucosaminyltransferase
Ligand
BDBM249850
Substrate
Meas. Tech.
MGAT LCMS Assay
pH
7.4±n/a
IC50
6.70±n/a nM
Comments
extracted
Citation
 Meng, WZhao, G Dihydropyridinone MGAT2 inhibitors for use in the treatment of metabolic disorders US Patent  US9701672 Publication Date 7/11/2017 
Target
Name:
Alpha-1,6-mannosyl-glycoprotein 2-beta-N-acetylglucosaminyltransferase
Synonyms:
2.4.1.143 GNT-II MGAT2 Mannoside acetylglucosaminyltransferase 2 Monoacylglycerol acyltransferase type 2 (h-MGAT2) h-MGAT2 (human monoacylglycerol acyltransferase type 2)
Type:
Mol. Mass.:
51567.80
Organism:
Homo sapiens (Human)
Description:
Q10469
Residue:
447
  
Inhibitor
Name:
BDBM249850
Synonyms:
US9701672, 40
Type:
Small organic molecule
Emp. Form.:
C24H22F7N7O2
Mol. Mass.:
573.466
SMILES:
Fc1cc(OCCCC(F)(F)F)ccc1[C@@]1(CC(c2ccn(n2)C2CCC2)=C(c2nnn[nH]2)C(=O)N1)C(F)(F)F
: