Target
Alpha-1,6-mannosyl-glycoprotein 2-beta-N-acetylglucosaminyltransferase
Ligand
BDBM252410
Substrate
Meas. Tech.
MGAT LCMS Assay
pH
7.4±n/a
IC50
2.70±n/a nM
Comments
extracted
Citation
 Meng, WZhao, G Dihydropyridinone MGAT2 inhibitors for use in the treatment of metabolic disorders US Patent  US9701672 Publication Date 7/11/2017 
Target
Name:
Alpha-1,6-mannosyl-glycoprotein 2-beta-N-acetylglucosaminyltransferase
Synonyms:
2.4.1.143 GNT-II MGAT2 Mannoside acetylglucosaminyltransferase 2 Monoacylglycerol acyltransferase type 2 (h-MGAT2) h-MGAT2 (human monoacylglycerol acyltransferase type 2)
Type:
Mol. Mass.:
51567.80
Organism:
Homo sapiens (Human)
Description:
Q10469
Residue:
447
  
Inhibitor
Name:
BDBM252410
Synonyms:
US9701672, 47
Type:
Small organic molecule
Emp. Form.:
C25H24F7N7O
Mol. Mass.:
571.4932
SMILES:
Fc1cc(CCCCC(F)(F)F)ccc1[C@@]1(CC(c2ccn(n2)C2CCC2)=C(c2nnn[nH]2)C(=O)N1)C(F)(F)F
: