Target
Alpha-1,6-mannosyl-glycoprotein 2-beta-N-acetylglucosaminyltransferase
Ligand
BDBM254007
Substrate
Meas. Tech.
MGAT LCMS Assay
pH
7.4±n/a
IC50
522±n/a nM
Comments
extracted
Citation
 Meng, WZhao, G Dihydropyridinone MGAT2 inhibitors for use in the treatment of metabolic disorders US Patent  US9701672 Publication Date 7/11/2017 
Target
Name:
Alpha-1,6-mannosyl-glycoprotein 2-beta-N-acetylglucosaminyltransferase
Synonyms:
2.4.1.143 GNT-II MGAT2 Mannoside acetylglucosaminyltransferase 2 Monoacylglycerol acyltransferase type 2 (h-MGAT2) h-MGAT2 (human monoacylglycerol acyltransferase type 2)
Type:
Mol. Mass.:
51567.80
Organism:
Homo sapiens (Human)
Description:
Q10469
Residue:
447
  
Inhibitor
Name:
BDBM254007
Synonyms:
((S)-4-(4-Methyl-1H-pyrazol-1-yl)-2-oxo-6-(4-(4,4,4-trifluorobutoxy)phenyl)-6-(trifluoromethyl)-1,2,5,6-tetrahydropyridine-3-carbonitrile | US9701672, 77
Type:
Small organic molecule
Emp. Form.:
C21H18F6N4O2
Mol. Mass.:
472.3836
SMILES:
Cc1cnn(c1)C1=C(C#N)C(=O)N[C@@](C1)(c1ccc(OCCCC(F)(F)F)cc1)C(F)(F)F
: