Target
Bromodomain-containing protein 4 [342-460]
Ligand
BDBM362659
Substrate
Meas. Tech.
BRD4 AlphaScreen Assay
IC50
<25±n/a nM
Citation
 Combs, APSparks, RB Tricyclic heterocycles as bet protein inhibitors US Patent  US10227359 Publication Date 3/12/2019 
Target
Name:
Bromodomain-containing protein 4 [342-460]
Synonyms:
BRD4 BRD4_HUMAN Bromodomain-containing protein 4 (BRD4)(BD2) | HUNK1
Type:
Enzyme Catalytic Domain
Mol. Mass.:
13783.81
Organism:
Homo sapiens (Human)
Description:
a.a. 342-460 (BRD4-BD2)
Residue:
119
  
Inhibitor
Name:
BDBM362659
Synonyms:
N-{1-[(4S)-7-(3,5-dimethylisoxazol-4-yl)- 4-pyridin-2-yl-4,5-dihydroimidazo[1,5,4- de][1,4]benzoxazin-2-yl]piperidin-4- yl}ethanesulfonamide US9834565, Example 14
Type:
Small organic molecule
Emp. Form.:
C26H30N6O4S
Mol. Mass.:
522.619
SMILES:
CCS(=O)(=O)NC1CCN(CC1)c1nc2ccc(-c3c(C)noc3C)c3OCC(c4ccccn4)n1c23
: