Target
Free fatty acid receptor 4
Ligand
BDBM369439
Substrate
Meas. Tech.
Beta arrestin 2 Interaction Assay (BRET assay)
EC50
260±n/a nM
Citation
 Kumar, SSharma, RHalder, SSawargave, SPDeore, VB Compounds for use as GPR120 agonists US Patent  US10227360 Publication Date 3/12/2019 
Target
Name:
Free fatty acid receptor 4
Synonyms:
FFAR4 G-protein coupled receptor 120 G-protein coupled receptor GT01 GPR120 O3FAR1 PGR4
Type:
PROTEIN
Mol. Mass.:
42256.91
Organism:
Homo sapiens (Human)
Description:
ChEMBL_1508994
Residue:
377
  
Inhibitor
Name:
BDBM369439
Synonyms:
4-(4-((2-(2,3-Dihydro-1H-inden-5-yl)benzyl)oxy)phenyl)butanoic acid | US10227360, Example 33
Type:
Small organic molecule
Emp. Form.:
C26H26O3
Mol. Mass.:
386.4828
SMILES:
OC(=O)CCCc1ccc(OCc2ccccc2-c2ccc3CCCc3c2)cc1
: