Target
5-hydroxytryptamine receptor 7
Ligand
BDBM21376
Substrate
BDBM21342
Meas. Tech.
Radioligand Labeled Binding Assay
pH
7.4±n/a
Temperature
310.15±n/a K
Ki
229±12 nM
Citation
 Leopoldo, MLacivita, EContino, MColabufo, NABerardi, FPerrone, R Structure-activity relationship study on N-(1,2,3,4-tetrahydronaphthalen-1-yl)-4-aryl-1-piperazinehexanamides, a class of 5-HT7 receptor agents. 2. J Med Chem 50:4214-21 (2007)  
Target
Name:
5-hydroxytryptamine receptor 7
Synonyms:
5-HT-7 5-HT7 5-HT7S 5-hydroxytryptamine receptor 7 5HT7R_RAT GPRFO Serotonin (5-HT) receptor | Serotonin Receptor 7
Type:
G Protein-Coupled Receptor (GPCR)
Mol. Mass.:
49852.62
Organism:
Rattus norvegicus (rat)
Description:
Rat cloned 5-HT7R.
Residue:
448
  
Inhibitor
Name:
BDBM21376
Synonyms:
2-{4-[5-(1,2,3,4-tetrahydronaphthalen-1-ylcarbamoyl)pentyl]piperazin-1-yl}benzamide Piperazinehexanamide derivative, 14
Type:
Small organic molecule
Emp. Form.:
C27H36N4O2
Mol. Mass.:
448.6003
SMILES:
NC(=O)c1ccccc1N1CCN(CCCCCC(=O)NC2CCCc3ccccc23)CC1
:
Substrate
Name:
BDBM21342
Synonyms:
(4R,7R)-N,N-diethyl-6-methyl-6,11-diazatetracyclo[7.6.1.0^{2,7}.0^{12,16}]hexadeca-1(16),2,9,12,14-pentaene-4-carboxamide LSD LSD,(+) Lysergic Acid Diethylamide [3H]-LSD | d-Isolysergic acid amide
Type:
radiolabeled ligand
Emp. Form.:
C20H25N3O
Mol. Mass.:
323.432
SMILES:
[H][C@@]12Cc3c[nH]c4cccc(C1=C[C@H](CN2C)C(=O)N(CC)CC)c34
: