Target
Mu-type opioid receptor
Ligand
BDBM50001028
Substrate
Meas. Tech.
Opioid Receptor Binding Assay
EC50
61.0±n/a nM
Citation
 Blumberg, LCDeaver, DREyerman, DJWynn, TA Methods for treating depressive symptoms US Patent  US10231963 Publication Date 3/19/2019 
Target
Name:
Mu-type opioid receptor
Synonyms:
M-OR-1 MOR-1 MUOR1 Mu opiate receptor OPRM1 hMOP | mu-type opioid receptor isoform MOR-1
Type:
G Protein-Coupled Receptor (GPCR)
Mol. Mass.:
44789.51
Organism:
Homo sapiens (Human)
Description:
P35372
Residue:
400
  
Inhibitor
Name:
BDBM50001028
Synonyms:
(+)-PENTAZOCINE (2R,6R,11R)-6,11-Dimethyl-3-(3-methyl-but-2-enyl)-1,2,3,4,5,6-hexahydro-2,6-methano-benzo[d]azocin-8-ol 6,11-Dimethyl-3-(3-methyl-but-2-enyl)-1,2,3,4,5,6-hexahydro-2,6-methano-benzo[d]azocin-8-ol CHEMBL560 PENTAZOCINE (-) Pentazocine,(+/-) Talwin US10736890, Compound TABLE B.8 US9656961, Example 00125 | rel-(2R,6R,11R)-6,11-Dimethyl-3-(3-methyl-but-2-enyl)-1,2,3,4,5,6-hexahydro-2,6-methano-benzo[d]azocin-8-ol
Type:
Small organic molecule
Emp. Form.:
C19H27NO
Mol. Mass.:
285.4238
SMILES:
[#6]-[#6@H]1-[#6@H]-2-[#6]-c3ccc(-[#8])cc3[C@]1([#6])[#6]-[#6]-[#7]-2-[#6]\[#6]=[#6](\[#6])-[#6]
: