Target
Mu-type opioid receptor
Ligand
BDBM50001023
Substrate
Meas. Tech.
Opioid Receptor Binding Assay
EC50
1.30±n/a nM
Citation
 Blumberg, LCDeaver, DREyerman, DJWynn, TA Methods for treating depressive symptoms US Patent  US10231963 Publication Date 3/19/2019 
Target
Name:
Mu-type opioid receptor
Synonyms:
M-OR-1 MOR-1 MUOR1 Mu opiate receptor OPRM1 hMOP | mu-type opioid receptor isoform MOR-1
Type:
G Protein-Coupled Receptor (GPCR)
Mol. Mass.:
44789.51
Organism:
Homo sapiens (Human)
Description:
P35372
Residue:
400
  
Inhibitor
Name:
BDBM50001023
Synonyms:
(2R,6R,11R)-3-Cyclopropylmethyl-6,11-dimethyl-1,2,3,4,5,6-hexahydro-2,6-methano-benzo[d]azocin-8-ol CHEMBL56585 US10231963, Table B.9 US11534436, Compound Table B.9 | US9656961, Example 00126
Type:
Small organic molecule
Emp. Form.:
C18H25NO
Mol. Mass.:
271.3972
SMILES:
C[C@H]1[C@H]2Cc3ccc(O)cc3[C@]1(C)CCN2CC1CC1
: