Target
Mu-type opioid receptor
Ligand
BDBM179875
Substrate
Meas. Tech.
Opioid Receptor Binding Assay
IC50
1.30±n/a nM
Citation
 Blumberg, LCDeaver, DREyerman, DJWynn, TA Methods for treating depressive symptoms US Patent  US10231963 Publication Date 3/19/2019 
Target
Name:
Mu-type opioid receptor
Synonyms:
M-OR-1 MOR-1 MUOR1 Mu opiate receptor OPRM1 hMOP | mu-type opioid receptor isoform MOR-1
Type:
G Protein-Coupled Receptor (GPCR)
Mol. Mass.:
44789.51
Organism:
Homo sapiens (Human)
Description:
P35372
Residue:
400
  
Inhibitor
Name:
BDBM179875
Synonyms:
US10231963, Table B.21 US11534436, Compound Table B.21 US9656961, Example 00138
Type:
Small organic molecule
Emp. Form.:
C23H30N2O2
Mol. Mass.:
366.4965
SMILES:
NC(=O)c1ccc2C[C@@H]3[C@@H]4CCC(=C)C[C@]4(CCN3CC3CCC3)c2c1O
: