Target
Amyloid-beta precursor protein
Ligand
BDBM369599
Substrate
Meas. Tech.
TR-FRET Assay
IC50
1.000±n/a nM
Citation
 Csjernyik, GKarlstrom, SKers, AKolmodin, KNylof, MOhberg, LRakos, LSandberg, LSehgelmeble, FSoderman, PSwahn, BVon Berg, S Compounds and their use as BACE inhibitors US Patent  US10231967 Publication Date 3/19/2019 
Target
Name:
Amyloid-beta precursor protein
Synonyms:
A4 ABPP AICD-50 AICD-59 AID(57) APP Alzheimer disease amyloid protein Amyloid beta Protein Amyloid beta protein Abeta(1-42) Amyloid intracellular domain 57 Amyloid protein (Abeta42b) Beta amyloid A4 protein Beta-APP42 Beta-amyloid protein 42 C83 CVAP Gamma Secretase Gamma-CTF(57) Gamma-secretase Gamma-secretase C-terminal fragment 57 P3(40) PN-II Protease nexin-II S-APP-beta Soluble APP-beta | beta-Amyloid Precursor Protein (APP)
Type:
Single-pass type I membrane protein
Mol. Mass.:
86890.41
Organism:
Homo sapiens (Human)
Description:
P05067
Residue:
770
  
Inhibitor
Name:
BDBM369599
Synonyms:
3-[(1r,4r)-4″-Amino-4-(difluoromethoxy)-5″-methyl-3′H-dispiro[cyclohexane-1,2′-indene-1′,2″-imidazol]-6′-yl]-5-methoxybenzonitrile US9918985, Example 106
Type:
Small organic molecule
Emp. Form.:
C26H26F2N4O2
Mol. Mass.:
464.507
SMILES:
COc1cc(cc(c1)-c1ccc2C[C@@]3(CC[C@@H](CC3)OC(F)F)C3(N=C(C)C(N)=N3)c2c1)C#N
: