Target
Amyloid-beta precursor protein
Ligand
BDBM136898
Substrate
Meas. Tech.
sAPPbeta Release Assay
IC50
1.40±n/a nM
Citation
 Csjernyik, GKarlstrom, SKers, AKolmodin, KNylof, MOhberg, LRakos, LSandberg, LSehgelmeble, FSoderman, PSwahn, BVon Berg, S Compounds and their use as BACE inhibitors US Patent  US10231967 Publication Date 3/19/2019 
Target
Name:
Amyloid-beta precursor protein
Synonyms:
A4 ABPP AICD-50 AICD-59 AID(57) APP Alzheimer disease amyloid protein Amyloid beta Protein Amyloid beta protein Abeta(1-42) Amyloid intracellular domain 57 Amyloid protein (Abeta42b) Beta amyloid A4 protein Beta-APP42 Beta-amyloid protein 42 C83 CVAP Gamma Secretase Gamma-CTF(57) Gamma-secretase Gamma-secretase C-terminal fragment 57 P3(40) PN-II Protease nexin-II S-APP-beta Soluble APP-beta | beta-Amyloid Precursor Protein (APP)
Type:
Single-pass type I membrane protein
Mol. Mass.:
86890.41
Organism:
Homo sapiens (Human)
Description:
P05067
Residue:
770
  
Inhibitor
Name:
BDBM136898
Synonyms:
US10231967, Example 126 US9000185, 6 | US9918985, Example 126
Type:
Small organic molecule
Emp. Form.:
C23H31N3O2
Mol. Mass.:
381.5111
SMILES:
CO[C@H]1CC[C@@]2(Cc3ccc(OCC4CCC4)cc3C22N=C(C)C(N)=N2)CC1
: