Target
Lysine-specific histone demethylase 1A
Ligand
BDBM369462
Substrate
Meas. Tech.
LSD1 enzymatic activity
IC50
110±n/a nM
Citation
 Marx, MAVaisburg, AChristensen, JGGalemmo, Jr., RA LSD1 inhibitors US Patent  US10233152 Publication Date 3/19/2019 
Target
Name:
Lysine-specific histone demethylase 1A
Synonyms:
AOF2 Flavin-containing amine oxidase domain-containing protein 2 KDM1A KIAA0601 Lysine-specific demethylase 1 (LSD1) Lysine-specific histone demethylase 1 (LSD1)
Type:
Enzyme
Mol. Mass.:
92901.01
Organism:
Homo sapiens (Human)
Description:
O60341
Residue:
852
  
Inhibitor
Name:
BDBM369462
Synonyms:
1-(2-methoxy-3-phenoxy-propyl)-N-[trans-2-phenylcyclopropyl]piperidin-4-amine | US10233152, Example 2
Type:
Small organic molecule
Emp. Form.:
C24H32N2O2
Mol. Mass.:
380.5231
SMILES:
COC(COc1ccccc1)CN1CCC(CC1)N[C@H]1C[C@@H]1c1ccccc1
: