Target
Lysine-specific histone demethylase 1A
Ligand
BDBM369503
Substrate
Meas. Tech.
LSD1 enzymatic activity
IC50
15.0±n/a nM
Citation
 Marx, MAVaisburg, AChristensen, JGGalemmo, Jr., RA LSD1 inhibitors US Patent  US10233152 Publication Date 3/19/2019 
Target
Name:
Lysine-specific histone demethylase 1A
Synonyms:
AOF2 Flavin-containing amine oxidase domain-containing protein 2 KDM1A KIAA0601 Lysine-specific demethylase 1 (LSD1) Lysine-specific histone demethylase 1 (LSD1)
Type:
Enzyme
Mol. Mass.:
92901.01
Organism:
Homo sapiens (Human)
Description:
O60341
Residue:
852
  
Inhibitor
Name:
BDBM369503
Synonyms:
N-[2-[4-[[(1R,2S)-2-phenylcyclopropyl]amino]-1-piperidyl]propyl]methanesulfonamide | US10233152, Example 41
Type:
Small organic molecule
Emp. Form.:
C18H29N3O2S
Mol. Mass.:
351.507
SMILES:
CC(CNS(C)(=O)=O)N1CCC(CC1)N[C@@H]1C[C@H]1c1ccccc1
: