Target
Lysine-specific histone demethylase 1A
Ligand
BDBM369508
Substrate
Meas. Tech.
LSD1 enzymatic activity
IC50
58.0±n/a nM
Citation
 Marx, MAVaisburg, AChristensen, JGGalemmo, Jr., RA LSD1 inhibitors US Patent  US10233152 Publication Date 3/19/2019 
Target
Name:
Lysine-specific histone demethylase 1A
Synonyms:
AOF2 Flavin-containing amine oxidase domain-containing protein 2 KDM1A KIAA0601 Lysine-specific demethylase 1 (LSD1) Lysine-specific histone demethylase 1 (LSD1)
Type:
Enzyme
Mol. Mass.:
92901.01
Organism:
Homo sapiens (Human)
Description:
O60341
Residue:
852
  
Inhibitor
Name:
BDBM369508
Synonyms:
1-morpholino-3-phenyl-2-(4-(((1R,2S)-2-phenylcyclopropyl)amino)piperidin-1-yl)propan-1-one | US10233152, Example 46
Type:
Small organic molecule
Emp. Form.:
C27H35N3O2
Mol. Mass.:
433.5857
SMILES:
O=C(C(Cc1ccccc1)N1CCC(CC1)N[C@@H]1C[C@H]1c1ccccc1)N1CCOCC1
: