Target
Acetyl-CoA carboxylase 2
Ligand
BDBM369657
Substrate
Meas. Tech.
The Measurement of Inhibitory Activity on Human ACC1 and the ACC2
IC50
10.00±n/a nM
Citation
 Ohyabu, NKurahashi, KNishiura, YKatou, MMiyazaki, KSasaki, YWada, TIwatsu, M 9-membered fused ring derivative US Patent  US10233156 Publication Date 3/19/2019 
Target
Name:
Acetyl-CoA carboxylase 2
Synonyms:
ACACB ACC-beta ACCB Acetyl-CoA carboxylase 2 Acetyl-CoA carboxylase 2 (ACC2)
Type:
Protein
Mol. Mass.:
276535.21
Organism:
Homo sapiens (Human)
Description:
O00763
Residue:
2458
  
Inhibitor
Name:
BDBM369657
Synonyms:
US10233156, Example I-196
Type:
Small organic molecule
Emp. Form.:
C21H26F5N3O4
Mol. Mass.:
479.4409
SMILES:
C[C@@H](CC[C@H]1OC[C@@H](C[C@@H]1F)Oc1nc2c(F)cc(OCC(F)F)c(F)c2n1C)NC(C)=O
: