Target
Acetyl-CoA carboxylase 2
Ligand
BDBM369702
Substrate
Meas. Tech.
The Measurement of Inhibitory Activity on Human ACC1 and the ACC2
IC50
120±n/a nM
Citation
 Ohyabu, NKurahashi, KNishiura, YKatou, MMiyazaki, KSasaki, YWada, TIwatsu, M 9-membered fused ring derivative US Patent  US10233156 Publication Date 3/19/2019 
Target
Name:
Acetyl-CoA carboxylase 2
Synonyms:
ACACB ACC-beta ACCB Acetyl-CoA carboxylase 2 Acetyl-CoA carboxylase 2 (ACC2)
Type:
Protein
Mol. Mass.:
276535.21
Organism:
Homo sapiens (Human)
Description:
O00763
Residue:
2458
  
Inhibitor
Name:
BDBM369702
Synonyms:
US10233156, Example I-242
Type:
Small organic molecule
Emp. Form.:
C19H26F4N4O5S
Mol. Mass.:
498.492
SMILES:
C[C@@H](CO[C@H]1CC[C@@H](CC1)Oc1nc2c(F)cc(OCC(F)F)c(F)c2n1C)NS(N)(=O)=O
: