Target
Angiotensin-converting enzyme 2
Ligand
BDBM21455
Substrate
BDBM21453
Meas. Tech.
Enzyme Inhibition Assay
pH
6.8±n/a
Temperature
298.15±n/a K
Ki
3000±n/a nM
Citation
 Mores, AMatziari, MBeau, FCuniasse, PYiotakis, ADive, V Development of Potent and Selective Phosphinic Peptide Inhibitors of Angiotensin-Converting Enzyme 2. J Med Chem 51:2216-2226 (2008)  
Target
Name:
Angiotensin-converting enzyme 2
Synonyms:
ACE-related carboxypeptidase ACE2_HUMAN Angiotensin-converting enzyme homolog Metalloprotease MPROT15
Type:
Enzyme
Mol. Mass.:
92448.86
Organism:
Homo sapiens (Human)
Description:
Residue:
805
  
Inhibitor
Name:
BDBM21455
Synonyms:
3-({1-[(benzyloxy)carbonyl]pyrrolidin-2-yl}(hydroxy)phosphoryl)-2-methylpropanoic acid | Phosphinic Peptide Inhibitor, 14
Type:
Small organic molecule
Emp. Form.:
C16H22NO6P
Mol. Mass.:
355.3227
SMILES:
CC(CP(O)(O)C1=CCCN1C(=O)OCc1ccccc1)C(O)=O
:
Substrate
Name:
BDBM21453
Synonyms:
(7-methoxycoumarin-4-yl)acetyl-Ala-Pro-Lys(2,4-dinitrophenyl)-OH Mca-Ala-Pro-Lys(Dnp)-OH
Type:
Fluorogenic Substrate
Emp. Form.:
Mol. Mass.:
SMILES:
: