Target
Carboxypeptidase A1
Ligand
BDBM21470
Substrate
BDBM21477
Meas. Tech.
Enzyme Inhibition Assay
Ki
60±n/a nM
Citation
 Mores, AMatziari, MBeau, FCuniasse, PYiotakis, ADive, V Development of Potent and Selective Phosphinic Peptide Inhibitors of Angiotensin-Converting Enzyme 2. J Med Chem 51:2216-2226 (2008)  
Target
Name:
Carboxypeptidase A1
Synonyms:
CBPA1_BOVIN CPA1 Carboxypeptidase A (CPA) | Carboxypeptidase A1 precursor
Type:
Enzyme
Mol. Mass.:
47073.90
Organism:
Bos taurus (bovine)
Description:
From Sigma-Aldrich Co.
Residue:
419
  
Inhibitor
Name:
BDBM21470
Synonyms:
2-benzyl-3-({1-[2-acetamido-3-(1H-imidazol-4-yl)propanoyl]pyrrolidin-2-yl}(hydroxy)phosphoryl)propanoic acid The second fraction of the HPLC chromatogram.
Type:
Small organic molecule
Emp. Form.:
C22H29N4O6P
Mol. Mass.:
476.4626
SMILES:
CC(=O)NC(Cc1cnc[nH]1)C(=O)N1CCC=C1P(O)(O)CC(Cc1ccccc1)C(O)=O
:
Substrate
Name:
BDBM21477
Synonyms:
(2S)-2-[(2S)-2-[(2E)-3-(furan-2-yl)prop-2-enamido]-3-phenylpropanamido]-3-phenylpropanoic acid Furyl-acryloyl-phe-phe N- (3- [2-furyl] acryloyl)-phe-phe
Type:
Emp. Form.:
C25H24N2O5
Mol. Mass.:
432.4685
SMILES:
OC(=O)[C@H](Cc1ccccc1)NC(=O)[C@H](Cc1ccccc1)NC(=O)\C=C\c1ccco1
: