Target
Ribosomal protein S6 kinase beta-1
Ligand
BDBM369718
Substrate
Meas. Tech.
p70S6K Enzyme Assay
IC50
62±n/a nM
Citation
 Huck, BRLan, RPotnick, JDeSelm, LCCronin, Jr., MWNeagu, CChen, XBoivin, RJohnson, TLGoutopoulos, A Substituted pyrido[3,4-d]pyrimidines and pyrido[4,3-d]pyrimidines as p70S6K inhibitors US Patent  US10233160 Publication Date 3/19/2019 
Target
Name:
Ribosomal protein S6 kinase beta-1
Synonyms:
70 kDa ribosomal protein S6 kinase 1 70 kDa ribosomal protein kinase (p70S6K) Protein kinase 70S6K (T412E) RPS6KB1 Ribosomal protein S6 kinase I STK14A p70S6K1
Type:
Enzyme
Mol. Mass.:
59139.89
Organism:
Homo sapiens (Human)
Description:
His-tagged S6K1.
Residue:
525
  
Inhibitor
Name:
BDBM369718
Synonyms:
US10233160, Compound 8 | US9981925, Compound 8
Type:
Small organic molecule
Emp. Form.:
C16H12F3N5O
Mol. Mass.:
347.2946
SMILES:
NC(=O)c1cccc2c(NCc3ccc(cc3)C(F)(F)F)nnnc12
: