Target
RAC-alpha serine/threonine-protein kinase
Ligand
BDBM369730
Substrate
Meas. Tech.
AKT/PKB Kinase Assay
IC50
62±n/a nM
Citation
 Huck, BRLan, RPotnick, JDeSelm, LCCronin, Jr., MWNeagu, CChen, XBoivin, RJohnson, TLGoutopoulos, A Substituted pyrido[3,4-d]pyrimidines and pyrido[4,3-d]pyrimidines as p70S6K inhibitors US Patent  US10233160 Publication Date 3/19/2019 
Target
Name:
RAC-alpha serine/threonine-protein kinase
Synonyms:
AKT phosphorylation (p-AKT) AKT1/PPP1CA C-AKT PKB alpha Protein kinase B Protein kinase B (Akt 1) Protein kinase B alpha Proto-oncogene Akt (Akt1) Proto-oncogene c-Akt (AKT1) RAC-PK-alpha RAC-alpha serine/threonine-protein kinase (AKT1) | RAC-alpha serine/threonine-protein kinase (pAKT)
Type:
Enzyme
Mol. Mass.:
55681.25
Organism:
Homo sapiens (Human)
Description:
P31749
Residue:
480
  
Inhibitor
Name:
BDBM369730
Synonyms:
US10233160, Compound 20 | US9981925, Compound 20
Type:
Small organic molecule
Emp. Form.:
C20H18ClF3N6O
Mol. Mass.:
450.845
SMILES:
NC(=O)c1cncc2c(N[C@H](CN3CCC3)c3ccc(Cl)c(c3)C(F)(F)F)ncnc12
: