Target
RAC-alpha serine/threonine-protein kinase
Ligand
BDBM369741
Substrate
Meas. Tech.
AKT/PKB Kinase Assay
IC50
300±n/a nM
Citation
 Huck, BRLan, RPotnick, JDeSelm, LCCronin, Jr., MWNeagu, CChen, XBoivin, RJohnson, TLGoutopoulos, A Substituted pyrido[3,4-d]pyrimidines and pyrido[4,3-d]pyrimidines as p70S6K inhibitors US Patent  US10233160 Publication Date 3/19/2019 
Target
Name:
RAC-alpha serine/threonine-protein kinase
Synonyms:
AKT phosphorylation (p-AKT) AKT1/PPP1CA C-AKT PKB alpha Protein kinase B Protein kinase B (Akt 1) Protein kinase B alpha Proto-oncogene Akt (Akt1) Proto-oncogene c-Akt (AKT1) RAC-PK-alpha RAC-alpha serine/threonine-protein kinase (AKT1) | RAC-alpha serine/threonine-protein kinase (pAKT)
Type:
Enzyme
Mol. Mass.:
55681.25
Organism:
Homo sapiens (Human)
Description:
P31749
Residue:
480
  
Inhibitor
Name:
BDBM369741
Synonyms:
US10233160, Compound 32 | US9981925, Compound 32
Type:
Small organic molecule
Emp. Form.:
C18H18F2N6O2
Mol. Mass.:
388.3713
SMILES:
CNC[C@@H](Nc1ncnc2c(ccnc12)C(N)=O)c1cc(F)c(OC)cc1F
: