Target
RAC-alpha serine/threonine-protein kinase
Ligand
BDBM369772
Substrate
Meas. Tech.
AKT/PKB Kinase Assay
IC50
<25±n/a nM
Citation
 Huck, BRLan, RPotnick, JDeSelm, LCCronin, Jr., MWNeagu, CChen, XBoivin, RJohnson, TLGoutopoulos, A Substituted pyrido[3,4-d]pyrimidines and pyrido[4,3-d]pyrimidines as p70S6K inhibitors US Patent  US10233160 Publication Date 3/19/2019 
Target
Name:
RAC-alpha serine/threonine-protein kinase
Synonyms:
AKT phosphorylation (p-AKT) AKT1/PPP1CA C-AKT PKB alpha Protein kinase B Protein kinase B (Akt 1) Protein kinase B alpha Proto-oncogene Akt (Akt1) Proto-oncogene c-Akt (AKT1) RAC-PK-alpha RAC-alpha serine/threonine-protein kinase (AKT1) | RAC-alpha serine/threonine-protein kinase (pAKT)
Type:
Enzyme
Mol. Mass.:
55681.25
Organism:
Homo sapiens (Human)
Description:
P31749
Residue:
480
  
Inhibitor
Name:
BDBM369772
Synonyms:
US10233160, Compound 63 | US9981925, Compound 63
Type:
Small organic molecule
Emp. Form.:
C21H18F6N6O
Mol. Mass.:
484.3976
SMILES:
NC(=O)c1ccnc2c(N[C@H](CN3CCC3)c3ccc(c(c3)C(F)(F)F)C(F)(F)F)ncnc12
: