Target
Carboxypeptidase A1
Ligand
BDBM21489
Substrate
BDBM21477
Meas. Tech.
CPA Inhibition Assay
pH
7.5±n/a
Temperature
295.15±n/a K
IC50
27000±n/a nM
Citation
 Dales, NAGould, AEBrown, JACalderwood, EFGuan, BMinor, CAGavin, JMHales, PKaushik, VKStewart, MTummino, PJVickers, CSOcain, TDPatane, MA Substrate-based design of the first class of angiotensin-converting enzyme-related carboxypeptidase (ACE2) inhibitors. J Am Chem Soc 124:11852-3 (2002)  
Target
Name:
Carboxypeptidase A1
Synonyms:
CBPA1_BOVIN CPA1 Carboxypeptidase A (CPA) | Carboxypeptidase A1 precursor
Type:
Enzyme
Mol. Mass.:
47073.90
Organism:
Bos taurus (bovine)
Description:
From Sigma-Aldrich Co.
Residue:
419
  
Inhibitor
Name:
BDBM21489
Synonyms:
(2S)-2-{[(1S)-1-carboxy-2-{1-[(3,5-dichlorophenyl)methyl]-1H-imidazol-5-yl}ethyl]amino}-4-methylpentanoic acid CHEMBL429844 MLN-4760 | MLN4760
Type:
Small organic molecule
Emp. Form.:
C19H23Cl2N3O4
Mol. Mass.:
428.31
SMILES:
CC(C)C[C@H](N[C@@H](Cc1cncn1Cc1cc(Cl)cc(Cl)c1)C(O)=O)C(O)=O
:
Substrate
Name:
BDBM21477
Synonyms:
(2S)-2-[(2S)-2-[(2E)-3-(furan-2-yl)prop-2-enamido]-3-phenylpropanamido]-3-phenylpropanoic acid Furyl-acryloyl-phe-phe N- (3- [2-furyl] acryloyl)-phe-phe
Type:
Emp. Form.:
C25H24N2O5
Mol. Mass.:
432.4685
SMILES:
OC(=O)[C@H](Cc1ccccc1)NC(=O)[C@H](Cc1ccccc1)NC(=O)\C=C\c1ccco1
: