Target
Glutamate receptor ionotropic, NMDA 1/2B
Ligand
BDBM276535
Substrate
Meas. Tech.
NMDA receptor FLIPR assay
IC50
1.000±n/a nM
Citation
 Chen, GChrovian, CCCoate, HRDvorak, CAGelin, CFHiscox, ALetavic, MARech, JCSoyode-Johnson, AStenne, BWall, JLZhang, W Substituted 1,2,3-triazoles as NR2B-selective NMDA modulators US Patent  US10233173 Publication Date 3/19/2019 
Target
Name:
Glutamate receptor ionotropic, NMDA 1/2B
Synonyms:
GluN1/GluN2B NMDA receptor Glutamate [NMDA] receptor subunit epsilon 2/zeta 1 nr2b nam
Type:
Enzyme
Mol. Mass.:
Description:
Components:
This complex has 2 components.
Component 1
Name:
Glutamate receptor ionotropic, NMDA 1
Synonyms:
GRIN1 Glutamate [NMDA] receptor subunit zeta-1 N-methyl-D-aspartate receptor subunit NR1 NMDZ1_HUMAN | phencyclidine
Type:
Enzyme Catalytic Domain
Mol. Mass.:
105397.81
Organism:
Homo sapiens (Human)
Description:
Q05586
Residue:
938
  
Component 2
Name:
Glutamate receptor ionotropic, NMDA 2B
Synonyms:
GRIN2B Glutamate [NMDA] receptor subunit epsilon 2 N-methyl D-aspartate receptor subtype 2B NMDAR2B NR3 | hNR3
Type:
PROTEIN
Mol. Mass.:
166375.46
Organism:
Homo sapiens (Human)
Description:
ChEMBL_1438829
Residue:
1484
  
Inhibitor
Name:
BDBM276535
Synonyms:
2-[[1-(4-Fluoro-3-methyl-phenyl)triazol-4-yl]methoxy]-5-methoxy- US10233173, Example 475
Type:
Small organic molecule
Emp. Form.:
C15H14FN5O2
Mol. Mass.:
315.3024
SMILES:
COc1cnc(OCc2cn(nn2)-c2ccc(F)c(C)c2)nc1
: