Target
Ectonucleotide pyrophosphatase/phosphodiesterase family member 2
Ligand
BDBM369947
Substrate
Meas. Tech.
Autotaxin LPC Cascade Assay
IC50
<500±n/a nM
Citation
 Babiss, LClark, MKeefe, ADMulvihill, MJNi, HRenzetti, LRuebsam, FWang, CXie, ZZhang, Y Substituted spirocyclic inhibitors of autotaxin US Patent  US10233182 Publication Date 3/19/2019 
Target
Name:
Ectonucleotide pyrophosphatase/phosphodiesterase family member 2
Synonyms:
ATX Autotaxin (ATX) ENPP2 Ectonucleotide Pyrophosphatase/Phosphodiesterase 2 (ENPP2) Extracellular lysophospholipase D PDNP2
Type:
Enzyme
Mol. Mass.:
99007.13
Organism:
Homo sapiens (Human)
Description:
Q13822
Residue:
863
  
Inhibitor
Name:
BDBM369947
Synonyms:
(R)—N-(1-(1-(1H-Indazol-5-yl)-3-methyl-2,4-dioxo-1,3,8-triazaspiro[4.5]decan-8-yl)-3-methyl-1-oxobutan-2-yl)-3-chloro-5-(trifluoromethyl)benzamide | US10233182, Example 60
Type:
Small organic molecule
Emp. Form.:
C28H28ClF3N6O4
Mol. Mass.:
605.008
SMILES:
CC(C)[C@@H](NC(=O)c1cc(Cl)cc(c1)C(F)(F)F)C(=O)N1CCC2(CC1)N(C(=O)N(C)C2=O)c1ccc2[nH]ncc2c1
: