Target
Endothelin-converting enzyme 1
Ligand
BDBM21645
Substrate
BDBM21661
Meas. Tech.
In Vitro Inhibition of NEP
Ki
200±n/a nM
Citation
 Inguimbert, NCoric, PPoras, HMeudal, HTeffot, FFournié-Zaluski, MCRoques, BP Toward an optimal joint recognition of the S1' subsites of endothelin converting enzyme-1 (ECE-1), angiotensin converting enzyme (ACE), and neutral endopeptidase (NEP). J Med Chem 45:1477-86 (2002)  
Target
Name:
Endothelin-converting enzyme 1
Synonyms:
ECE-1 ECE1_HUMAN Endothelin-converting enzyme 1 (ECE1)
Type:
Enzyme
Mol. Mass.:
87155.11
Organism:
Homo sapiens (Human)
Description:
P42892
Residue:
770
  
Inhibitor
Name:
BDBM21645
Synonyms:
(2S)-3-(1H-indol-3-yl)-2-[(2R,3R)-3-phenyl-2-(sulfanylmethyl)butanamido]propanoic acid | Mercaptoacyl amino acid compound, 9b
Type:
Small organic molecule
Emp. Form.:
C22H24N2O3S
Mol. Mass.:
396.503
SMILES:
C[C@H]([C@@H](CS)C(=O)N[C@@H](Cc1c[nH]c2ccccc12)C(O)=O)c1ccccc1
:
Substrate
Name:
BDBM21661
Synonyms:
Ac-Ile-Ile-Pya-Nop-Asn-Thr-Pro-Glu-His-Val-Val-Pro-Tyr-Gly-Leu-Gly-Ser-COOH Pya(21)-Nop(22)-bET-1(19--35), Pra= pyrenylalanine, Nop=p-nitrophenylalanine
Type:
Emp. Form.:
Mol. Mass.:
SMILES:
: