Target
Bile acid receptor
Ligand
BDBM370088
Substrate
Meas. Tech.
FXR Agonist Assay
EC50
<200±n/a nM
Citation
 Pratt, BAMohan, R Fused bicyclic compounds for the treatment of disease US Patent  US10233187 Publication Date 3/19/2019 
Target
Name:
Bile acid receptor
Synonyms:
BAR FXR HRR1 NR1H4_HUMAN RIP14 Retinoid X receptor-interacting protein 14 | farnesoid x receptor
Type:
Nuclear Receptor
Mol. Mass.:
55916.24
Organism:
Homo sapiens (Human)
Description:
Q96RI1
Residue:
486
  
Inhibitor
Name:
BDBM370088
Synonyms:
US10233187, Example 26
Type:
Small organic molecule
Emp. Form.:
C24H29F2N3O3
Mol. Mass.:
445.5022
SMILES:
CC(C)Cc1n[nH]c2c1C(C)(C)CN(C=C2C(=O)OC(C)C)C(=O)c1ccc(F)c(F)c1
: