Target
Bile acid receptor
Ligand
BDBM370111
Substrate
Meas. Tech.
FXR Agonist Assay
EC50
600±n/a nM
Citation
 Pratt, BAMohan, R Fused bicyclic compounds for the treatment of disease US Patent  US10233187 Publication Date 3/19/2019 
Target
Name:
Bile acid receptor
Synonyms:
BAR FXR HRR1 NR1H4_HUMAN RIP14 Retinoid X receptor-interacting protein 14 | farnesoid x receptor
Type:
Nuclear Receptor
Mol. Mass.:
55916.24
Organism:
Homo sapiens (Human)
Description:
Q96RI1
Residue:
486
  
Inhibitor
Name:
BDBM370111
Synonyms:
US10233187, Example 49
Type:
Small organic molecule
Emp. Form.:
C19H20FN3O3
Mol. Mass.:
357.3788
SMILES:
CCOC(=O)C1=CN(CC(C)(C)c2cn[nH]c12)C(=O)c1cccc(F)c1
: