Target
Nuclear receptor subfamily 1 group I member 2
Ligand
BDBM19993
Substrate
BDBM21662
Meas. Tech.
Competition Ligand Binding Assay and Transient Transfection Assay
pH
8±n/a
Temperature
295.15±n/a K
IC50
40±n/a nM
EC50
13±n/a nM
Citation
 Xue, YChao, EZuercher, WJWillson, TMCollins, JLRedinbo, MR Crystal structure of the PXR-T1317 complex provides a scaffold to examine the potential for receptor antagonism. Bioorg Med Chem 15:2156-66 (2007)  
Target
Name:
Nuclear receptor subfamily 1 group I member 2
Synonyms:
NR1I2 Orphan nuclear receptor PAR1 PXR SXR nuclear receptor subfamily 1 group I member 2 isoform 1
Type:
Nuclear receptor
Mol. Mass.:
49774.77
Organism:
Homo sapiens (Human)
Description:
O75469
Residue:
434
  
Inhibitor
Name:
BDBM19993
Synonyms:
CHEMBL62136 T 0901317 TO-901317 US10669296, Compound TO901317 [3H]T0901317
Type:
Small organic molecule
Emp. Form.:
C17H12F9NO3S
Mol. Mass.:
481.333
SMILES:
OC(c1ccc(cc1)N(CC(F)(F)F)S(=O)(=O)c1ccccc1)(C(F)(F)F)C(F)(F)F
:
Substrate
Name:
BDBM21662
Synonyms:
[N-Methyl-3H]-GW0438X
Type:
radiolabeled ligand
Emp. Form.:
Mol. Mass.:
SMILES:
: