Target
Nuclear receptor subfamily 1 group I member 2
Ligand
BDBM21672
Substrate
BDBM21662
Meas. Tech.
Competition Ligand Binding Assay and Transient Transfection Assay
pH
8±n/a
Temperature
295.15±n/a K
IC50
631±n/a nM
EC50
1000±n/a nM
Citation
 Xue, YChao, EZuercher, WJWillson, TMCollins, JLRedinbo, MR Crystal structure of the PXR-T1317 complex provides a scaffold to examine the potential for receptor antagonism. Bioorg Med Chem 15:2156-66 (2007)  
Target
Name:
Nuclear receptor subfamily 1 group I member 2
Synonyms:
NR1I2 Orphan nuclear receptor PAR1 PXR SXR nuclear receptor subfamily 1 group I member 2 isoform 1
Type:
Nuclear receptor
Mol. Mass.:
49774.77
Organism:
Homo sapiens (Human)
Description:
O75469
Residue:
434
  
Inhibitor
Name:
BDBM21672
Synonyms:
N-[4-(1,1,1-trifluoro-2-hydroxy-4-phenylbut-3-yn-2-yl)phenyl]-N-(2,2,2-trifluoroethyl)benzenesulfonamide | T0901317 analogue, 11
Type:
Small organic molecule
Emp. Form.:
C24H17F6NO3S
Mol. Mass.:
513.452
SMILES:
OC(C#Cc1ccccc1)(c1ccc(cc1)N(CC(F)(F)F)S(=O)(=O)c1ccccc1)C(F)(F)F
:
Substrate
Name:
BDBM21662
Synonyms:
[N-Methyl-3H]-GW0438X
Type:
radiolabeled ligand
Emp. Form.:
Mol. Mass.:
SMILES:
: