Target
Protein O-GlcNAcase
Ligand
BDBM255771
Substrate
Meas. Tech.
Fluorescence-based ELISA assay
Temperature
298.15±n/a K
Ki
243±n/a nM
Comments
extracted
Citation
 Li, TMceachern, EJVocadlo, DJZhou, YZhu, YSelnick, HG Selective glycosidase inhibitors and uses thereof US Patent  US9701693 Publication Date 7/11/2017 
Target
Name:
Protein O-GlcNAcase
Synonyms:
2-acetamido-2-deoxy-β-D-glucopyranosidase (O-GlcNAcase) Beta-hexosaminidase (O-GlcNAcase) HEXC MEA5 N-acetyl-beta-D-glucosaminidase (O-GlcNAcase) OGA Protein O-GlcNAcase
Type:
Enzyme
Mol. Mass.:
102874.67
Organism:
Homo sapiens (Human)
Description:
O60502
Residue:
916
  
Inhibitor
Name:
BDBM255771
Synonyms:
(3aR,5R,6R,7R,7aR)-5- (hydroxymethyl)-2-(methylamino)- 5,6,7,7a-tetrahydro-3aH-pyrano[3,2- d]thiazole-6,7-diol | US9701693, 1
Type:
Small organic molecule
Emp. Form.:
C8H14N2O4S
Mol. Mass.:
234.273
SMILES:
CNC1=N[C@H]2[C@H](O[C@H](CO)[C@H](O)[C@@H]2O)S1
: