Target
G-protein coupled bile acid receptor 1
Ligand
BDBM21678
Substrate
BDBM10852
Meas. Tech.
TGR5 Activity Assay
pH
7.2±n/a
Temperature
310.15±n/a K
EC50
140±n/a nM
Comments
The efficacy=105% of 10 uM LCA.
Citation
 Pellicciari, RSato, HGioiello, ACostantino, GMacchiarulo, ASadeghpour, BMGiorgi, GSchoonjans, KAuwerx, J Nongenomic actions of bile acids. Synthesis and preliminary characterization of 23- and 6,23-alkyl-substituted bile acid derivatives as selective modulators for the G-protein coupled receptor TGR5. J Med Chem 50:4265-8 (2007)  
Target
Name:
G-protein coupled bile acid receptor 1
Synonyms:
BG37 GPBAR_HUMAN TGR5 hGPCR19
Type:
G Protein-Coupled Receptor (GPCR)
Mol. Mass.:
35260.02
Organism:
Homo sapiens (Human)
Description:
CHO cells transiently transfected with hTGR5.
Residue:
330
  
Inhibitor
Name:
BDBM21678
Synonyms:
(2S,4R)-4-[(1S,2S,5R,7S,8R,9R,10S,11S,14R,15R)-5,9-dihydroxy-2,8,15-trimethyltetracyclo[8.7.0.0^{2,7}.0^{11,15}]heptadecan-14-yl]-2-methylpentanoic acid | 23(S)-methyl-BA derivative, 7b
Type:
Steroid
Emp. Form.:
C26H44O4
Mol. Mass.:
420.6252
SMILES:
[H][C@@]1(CC[C@@]2([H])[C@]3([H])[C@H](O)[C@H](C)[C@]4([H])C[C@H](O)CC[C@]4(C)[C@@]3([H])CC[C@]12C)[C@H](C)C[C@H](C)C(O)=O
:
Substrate